{"text_format":"1","workbook":"xlsx","n_sheets":11,"sheets":["Summary page","Data for charts","A&E","Mortality","DD","Process Data","Emergency","Data for chart 2","Combo","Intro","Process Implementation"],"not_rendered":{"charts":6,"images":0,"macros":0,"external_links":0,"defined_names":6,"comments":0,"pivot_tables":0},"unopened":[],"bounds":{"document_bytes":16777216,"sheet_cells":100000,"rows_first":2000,"rows_last":500,"rows_between":2000,"halvings":0,"cell_chars":16384,"cell_head_chars":4096},"cells_cut":0,"cells_raw":0,"read":"whole","date_system":"1900"}

{"sheet":"Summary page","index":0,"n_rows":34,"n_cols":8,"rows_kept":34,"cut":false,"hidden":false,"merged":[[2,0,7,0],[0,0,0,7],[9,2,11,2],[10,3,11,3],[10,4,11,4],[10,5,11,5],[10,6,11,6],[10,7,11,7],[27,0,27,1],[28,0,29,0],[9,3,9,6],[12,0,16,0],[10,0,10,1],[18,0,18,1],[11,0,11,1]]}
["Person-centred health and care real-time and right-time test site data dashboard"]
[null,null,null,"Updated 12/09/17","updated 20/09/17"]
["Key","For consideration in external evaluation"]
[null,"Priority for December 2016"]
[null,"Deterioration"]
[null,"No change"]
[null,"Improvement"]
[null,"Not enough data to make an assesment"]
[]
[null,null,"Agreed operational definitions","Local operational definitions"]
[null,null,null,"NHS Tayside Updated 12/09/17","NHS Greater Glasgow and Clyde updated 20/09/17","NHS Lanarkshire","NHS Western Isles","Notes 030417"]
["Overarching"]
["General","1. Percentage positive feedback on overall care experience",null,"Percentage of patients who score their overall care as  4 (good) and 5 (excellent) .","The calculation is the aggregated % of positives responses to all enquiry questions. ","Real-time and right-time will report the percentage of people that are \"happy with the care and support\" they received. \nClinical Quality are currently aggregating historical data against the 5 MDWM measures recorded previously to give a compliance measurement for \"real-time\".","Calculation for Overall Care Experience % is found using the formula: No. of interviews with a positive response to (Q2+Q3+Q4+Q5) divided by total no. of interviews x 100 to give the percentage.","NHS Lanarkshire - not able to accurately measure experience at this time on LanQip"]
[null,"2. Total number of improvement teams established","Number of test areas involved.",null,"Number of team clusters.","Number of wards/departments that are partcipating in the programme.","The 3 test sites continue to develop testing. These are Surgical Ward and Medical 2 at Western Isles Hospital and the General Ward and Uist and Barra Hospital."]
[null,"NOT INCLUDED IN CURRENT DASHBOARD DATA 2a. Total number of improvement teams following model","Number of test areas following model (i.e. meeting regularly to review and use care experience data for improvement).",null,"Number of improvement teams that are using the model to collect, review and act on their patient feedback data"]
{"$rows_left_out":20}
{"sheet":"Data for charts","index":1,"n_rows":73,"n_cols":21,"rows_kept":73,"cut":false,"hidden":true,"merged":[]}
[]
[]
[]
[]
[]
[]
[]
[]
[]
[null,"4)."]
[null,"2014-09-01","2014-10-01","2014-11-01","2014-12-01","2015-01-01","2015-02-01","2015-03-01","2015-04-01","2015-05-01","2015-06-01","2015-07-01","2015-08-01","2015-09-01","2015-10-01","2015-11-01","2015-12-01","2016-01-01","2016-02-01"]
[null,{"$f":"(B18/$T$32)*100000","v":{"$error":"#REF!"}},{"$f":"(C18/$T$32)*100000","v":{"$error":"#REF!"}},{"$error":"#REF!"},{"$error":"#REF!"},{"$error":"#REF!"},{"$error":"#REF!"},{"$error":"#REF!"},{"$f":"(I18/$U$32)*100000","v":{"$error":"#REF!"}},{"$f":"(J18/$U$32)*100000","v":{"$error":"#REF!"}},{"$error":"#REF!"},{"$error":"#REF!"},{"$error":"#REF!"},{"$error":"#REF!"},{"$error":"#REF!"},{"$error":"#REF!"},{"$error":"#REF!"},{"$error":"#REF!"},{"$error":"#REF!"}]
[null,{"$f":"MEDIAN($B$12:$M$12)","v":{"$error":"#REF!"}},{"$f":"MEDIAN($B$12:$M$12)","v":{"$error":"#REF!"}},{"$error":"#REF!"},{"$error":"#REF!"},{"$error":"#REF!"},{"$error":"#REF!"},{"$error":"#REF!"},{"$error":"#REF!"},{"$error":"#REF!"},{"$error":"#REF!"},{"$error":"#REF!"},{"$error":"#REF!"}]
[null,null,null,null,null,null,null,null,null,null,null,null,{"$f":"MEDIAN($B$12:$M$12)","v":{"$error":"#REF!"}},{"$f":"MEDIAN($B$12:$M$12)","v":{"$error":"#REF!"}},{"$error":"#REF!"},{"$error":"#REF!"},{"$error":"#REF!"},{"$error":"#REF!"},{"$error":"#REF!"}]
[]
{"$rows_left_out":59}
{"sheet":"A&E","index":2,"n_rows":12,"n_cols":20,"rows_kept":12,"cut":false,"hidden":true,"merged":[]}
[1,2,3,4,5,6,7,8,9,10,11,12,13,14,15,16,17,18,19,20]
[null,"Partnership","2014-09-30","2014-10-31","2014-11-30","2014-12-31","2015-01-31","2015-02-28","2015-03-31","2015-04-30","2015-05-31","2015-06-30","2015-07-01","2015-08-01","2015-09-01","2015-10-01","2015-11-01","2015-12-01","2016-01-01","2016-02-01"]
[1,"Argyll & Bute",8812,7751,7413,7238,7335,6869,8011,8202,8871,8607,9311,9688,8690,8050,7436,7459,7629,7460]
[8,"Scottish Borders",2550,2266,2077,2378,2357,2190,2515,2444,2549,2449,2232,2479,2412,2494,2199,1980,2099,2071]
[2,"City of Edinburgh",22307,21550,21321,21210,20698,19432,22006,21165,21735,21548,20640,22706,22456,22054,21741,20858,21894,21501]
[5,"Midlothian",22307,21550,21321,21210,20698,19432,22006,21165,21735,21548,20640,22706,22456,22054,21741,20858,21894,21501]
[3,"Fife",7808,7149,6816,6861,6808,6698,7544,7540,7795,8012,7533,8093,7768,7482,7068,6761,7118,7234]
[4,"Glasgow City",39296,37530,37603,36118,36167,33945,38245,37064,36385,33655,32852,35943,34965,34700,33159,32434,33413,33339]
[6,"North Lanarkshire",16271,15454,15063,14674,15056,14319,15888,15434,16092,16037,15675,16987,16281,15865,15251,15048,16079,15419]
[9,"Scotland",142622,133528,131004,129316,129269,121281,137572,134713,138077,134757,131948,142082,137080,133028,127527,125203,129524,127713]
[7,"South Lanarkshire",16271,15454,15063,14674,15056,14319,15888,15434,16092,16037,15675,16987,16281,15865,15251,15048,16079,15419]
[10,"LWiC Partnerships",135622,128704,126677,124363,124175,117204,132103,128448,131254,127893,124558,135589,131309,128564,123846,120446,126205,123944]

{"sheet":"Mortality","index":3,"n_rows":12,"n_cols":19,"rows_kept":12,"cut":false,"hidden":true,"merged":[]}
["Partnership","2014-09-01","2014-10-01","2014-11-01","2014-12-01","2015-01-01","2015-02-01","2015-03-01","2015-04-01","2015-05-01","2015-06-01","2015-07-01","2015-08-01","2015-09-01","2015-10-01","2015-11-01","2015-12-01","2016-01-01","2016-02-01"]
["Argyll & Bute",99,92,85,90,125,106,114,98,92,102,89,91,91,92,89,84,116,90]
["Edinburgh City",348,360,338,435,432,412,385,356,322,336,334,303,366,349,336,395,375,399]
["Fife",286,344,276,326,440,364,363,351,346,303,295,283,307,317,301,357,362,359]
["Glasgow City",484,518,487,596,650,630,588,550,526,535,521,455,476,512,512,561,547,578]
["Midlothian",59,72,72,77,95,75,77,86,79,67,62,63,70,64,64,92,72,56]
["North Lanarkshire",269,311,272,354,371,316,338,310,255,306,299,300,287,266,298,278,320,359]
["Scottish Border",103,130,89,144,147,137,141,118,105,127,101,109,89,81,103,131,101,107]
["South Lanarkshire",261,309,244,361,357,336,318,277,300,272,285,259,275,255,264,298,349,300]
["Scotland",4347,4749,4257,5490,5919,5331,5272,4791,4408,4703,4506,4206,4371,4475,4570,5020,5104,5118]
["LWiC Partnerships",1909,2136,1863,2383,2617,2376,2324,2146,2025,2048,1986,1863,1961,1936,1967,2196,2242,2248]
[null,2,3,4,5,6,7,8,9,10,11,12,13,14,15,16,17,18,19]

{"sheet":"DD","index":4,"n_rows":84,"n_cols":39,"rows_kept":84,"cut":false,"hidden":true,"merged":[]}
[1,2,3,4,5,6,7,8,9,10,11,12,13,14,15,16,17,18,19,20,21,22,23,null,1,2,3,4,5,6,7,8,9,10,11,12,13,14,15]
["Lookup","LA","AgeGroup","ComplexNeedsFlag","2014-09-01","2014-10-01","2014-11-01","2014-12-01","2015-01-01","2015-02-01","2015-03-01","2015-04-01","2015-05-01","2015-06-01","2015-07-01","2015-08-01","2015-09-01","2015-10-01","2015-11-01","2015-12-01","2016-01-01","2014 population","2015 population",null,"code","Area","Reason","Apr 2015","May 2015","Jun 2015","Jul 2015","Aug 2015","Sep 2015","Oct 2015","Nov 2015","Dec 2015","Jan 2016","Feb 2016","Mar 2016"]
["111","Argyll & Bute","18-74","All",60,69,101,240,317,183,121,141,208,293,260,235,213,258,256,262,264,null,null,null,"11","Argyll&Bute","Community Care Assessment reasons",4,5,6,3,5,3,4,3,1,6,0,0]
["112","Argyll & Bute","18-74","Code 9",60,37,63,107,110,79,74,44,93,90,117,155,150,155,150,150,141,null,null,null,"12","Argyll&Bute","Patients waiting to go home",3,5,2,5,4,3,2,11,7,3,0,0]
["113","Argyll & Bute","18-74","Standard",0,32,38,133,207,104,47,97,115,203,143,80,63,103,106,112,123,null,null,null,"13","Argyll&Bute","Awaiting funding for a care home placement",0,0,0,0,0,0,0,0,0,0,0,0]
["121","Argyll & Bute","75+","All",566,638,588,596,470,605,771,635,601,461,339,446,469,441,569,597,529,null,null,null,"14","Argyll&Bute","Awaiting place availability in a care home",3,2,1,3,1,1,1,3,1,1,0,0]
["122","Argyll & Bute","75+","Code 9",159,132,64,127,93,129,232,167,111,107,94,170,181,233,141,106,116,null,null,null,"15","Argyll&Bute","Healthcare Arrangements",0,0,0,0,1,1,0,0,0,1,0,0]
["123","Argyll & Bute","75+","Standard",407,506,524,469,377,476,539,468,490,354,245,276,288,208,428,491,413,null,null,null,"16","Argyll&Bute","Other",3,2,5,1,0,0,0,0,1,0,0,0]
["131","Argyll & Bute","All","All",626,707,689,836,787,788,892,776,809,754,599,681,682,699,825,859,793,87660,85510,null,"21","City of Edinburgh","Community Care Assessment reasons",21,17,25,20,13,21,23,28,26,30,0,0]
["132","Argyll & Bute","All","Code 9",219,169,127,234,203,208,306,211,204,197,211,325,331,388,291,256,257,87660,85510,null,"22","City of Edinburgh","Patients waiting to go home",63,73,77,93,82,95,95,80,68,66,0,0]
["133","Argyll & Bute","All","Standard",407,538,562,602,584,580,586,565,605,557,388,356,351,311,534,603,536,87660,85510,null,"23","City of Edinburgh","Awaiting funding for a care home placement",0,0,0,0,0,0,0,1,0,0,0,0]
["211","City of Edinburgh","18-74","All",2395,2626,2642,2792,2338,1920,2125,2922,2961,2465,2653,2442,2316,2551,2163,1934,2082,null,null,null,"24","City of Edinburgh","Awaiting place availability in a care home",39,41,33,39,38,41,30,36,26,26,0,0]
["212","City of Edinburgh","18-74","Code 9",442,621,603,638,395,309,314,707,778,386,252,289,325,379,424,423,379,null,null,null,"25","City of Edinburgh","Healthcare Arrangements",0,0,0,0,0,0,1,0,0,0,0,0]
["213","City of Edinburgh","18-74","Standard",1953,2005,2039,2154,1943,1611,1811,2215,2183,2079,2401,2153,1991,2172,1739,1511,1703,null,null,null,"26","City of Edinburgh","Other",1,3,7,3,1,0,0,1,1,0,0,0]
["221","City of Edinburgh","75+","All",5415,5219,5457,5921,5543,4792,5753,5187,5562,5331,5801,5729,5555,5256,4702,4554,4680,null,null,null,"31","Fife","Community Care Assessment reasons",22,23,46,26,31,45,36,48,32,33,0,0]
{"$rows_left_out":70}
{"sheet":"Process Data","index":5,"n_rows":29,"n_cols":27,"rows_kept":29,"cut":false,"hidden":true,"merged":[]}
[null,"Percentage of HSCPs identified for HRI support that undertake a 'deep dive' diagnostic",null,null,null,"Percentage of HSCPs engaged through LWiC that produce an action plan following a deep dive that has potential to change the delivery of local services",null,null,"Number of external programmes/organisations engaged in LWiC",null,null,"Percentage of HSCPs represented at LWiC events (%)",null,null,"Number of 'followers' for the LWiC twitter account",null,null,"Reach of LWiC twitter account",null,null,"Number of unique visitors to LWiC webpage",null,null,"Number of page views to LWiC webpage",null,null,"Percentage of HSCPs engaged through HRI support for whom a case study is created"]
["2015-10-01",null,null,null,null,0,null,null,93,{"$f":"MEDIAN($I$2:$I$7)","v":93},null,87,{"$f":"MEDIAN($L$2:$L$7)","v":88.5},null,65,null,null,19400,{"$f":"MEDIAN($R$2:$R$7)","v":13000}]
["2015-11-01",null,null,null,null,0,null,null,93,93,null,90,88.5,null,79,null,null,13000,13000,null,76,{"$f":"MEDIAN($U$3:$U$8)","v":107.5},null,95,{"$f":"MEDIAN($X$3:$X$8)","v":131}]
["2015-12-01",null,null,null,null,3,null,null,93,93,null,80,88.5,null,108,null,null,13000,13000,null,126,107.5,null,141,131]
["2016-01-01",null,null,null,null,3,null,null,97,93,null,86,88.5,null,122,null,null,7651,13000,null,116,107.5,null,140,131]
["2016-02-01",null,null,null,null,3,null,null,96,93,null,97,88.5,null,142,null,null,12691,13000,null,126,107.5,null,122,131]
["2016-03-01",null,null,null,null,3,null,null,90,93,{"$f":"MEDIAN($I$2:$I$7)","v":93},90,88.5,{"$f":"MEDIAN($L$2:$L$7)","v":88.5},162,null,null,14731,13000,{"$f":"MEDIAN($R$2:$R$7)","v":13000},82,107.5,null,145,131]
["2016-04-01",null,null,null,null,6,null,null,96,null,{"$f":"MEDIAN($I$2:$I$7)","v":93},95,null,88.5,182,null,null,18833,null,{"$f":"MEDIAN($R$2:$R$7)","v":13000},99,107.5,{"$f":"MEDIAN($U$3:$U$8)","v":107.5},98,131,{"$f":"MEDIAN($X$3:$X$8)","v":131}]
["2016-05-01",null,null,null,null,6,null,null,94,null,93,90,null,88.5,202,null,null,19333,null,13000,91,null,{"$f":"MEDIAN($U$3:$U$8)","v":107.5},117,null,{"$f":"MEDIAN($X$3:$X$8)","v":131}]
["2016-06-01",null,null,null,null,6,null,null,91,null,93,95,null,88.5,222,null,null,15545,null,13000,92,null,107.5,150,null,131]
["2016-07-01",null,null,null,null,6,null,null,97,null,93,93,null,88.5,242,null,null,9245,null,13000,106,null,107.5,131,null,131]
["2016-08-01",null,null,null,null,9,null,null,97,null,93,91,null,88.5,262,null,null,10944,null,13000,83,null,107.5,122,null,131]
["2016-09-01",null,null,null,null,9,null,null,91,null,93,85,null,88.5,282,null,null,16619,null,13000,82,null,107.5,134,null,131]
["2016-10-01",null,null,null,null,12,null,null,92,null,93,99,null,88.5,302,null,null,15418,null,13000,109,null,107.5,116,null,131]
["2016-11-01",null,null,null,null,12,null,null,96,null,93,97,null,88.5,322,null,null,14033,null,13000,88,null,107.5,105,null,131]
{"$rows_left_out":15}
{"sheet":"Emergency","index":6,"n_rows":33,"n_cols":6,"rows_kept":33,"cut":false,"hidden":true,"merged":[]}
[null,"Emergency Admissions"]
[]
[]
[]
[]
[]
[]
[]
[]
[]
[null,"Emergency Bed Days"]
[]
[]
[]
[]
{"$rows_left_out":19}
{"sheet":"Data for chart 2","index":7,"n_rows":15,"n_cols":12,"rows_kept":15,"cut":false,"hidden":true,"merged":[]}
[null,null,"2015-04-01","2015-05-01","2015-06-01","2015-07-01","2015-08-01","2015-09-01","2015-10-01","2015-11-01","2015-12-01"]
[null,"OBD",{"$f":"VLOOKUP(#REF!&#REF!&#REF!,dd,DD!L1,FALSE)","v":{"$error":"#REF!"}},{"$f":"VLOOKUP(#REF!&#REF!&#REF!,dd,DD!M1,FALSE)","v":{"$error":"#REF!"}},{"$f":"VLOOKUP(#REF!&#REF!&#REF!,dd,DD!N1,FALSE)","v":{"$error":"#REF!"}},{"$f":"VLOOKUP(#REF!&#REF!&#REF!,dd,DD!O1,FALSE)","v":{"$error":"#REF!"}},{"$f":"VLOOKUP(#REF!&#REF!&#REF!,dd,DD!P1,FALSE)","v":{"$error":"#REF!"}},{"$f":"VLOOKUP(#REF!&#REF!&#REF!,dd,DD!Q1,FALSE)","v":{"$error":"#REF!"}},{"$f":"VLOOKUP(#REF!&#REF!&#REF!,dd,DD!R1,FALSE)","v":{"$error":"#REF!"}},{"$f":"VLOOKUP(#REF!&#REF!&#REF!,dd,DD!S1,FALSE)","v":{"$error":"#REF!"}},{"$f":"VLOOKUP(#REF!&#REF!&#REF!,dd,DD!T1,FALSE)","v":{"$error":"#REF!"}}]
[]
[]
[]
[null,"Code 9",{"$f":"VLOOKUP(#REF!&#REF!&2,dd,DD!L1,FALSE)","v":{"$error":"#REF!"}},{"$f":"VLOOKUP(#REF!&#REF!&2,dd,DD!M1,FALSE)","v":{"$error":"#REF!"}},{"$f":"VLOOKUP(#REF!&#REF!&2,dd,DD!N1,FALSE)","v":{"$error":"#REF!"}},{"$f":"VLOOKUP(#REF!&#REF!&2,dd,DD!O1,FALSE)","v":{"$error":"#REF!"}},{"$f":"VLOOKUP(#REF!&#REF!&2,dd,DD!P1,FALSE)","v":{"$error":"#REF!"}},{"$f":"VLOOKUP(#REF!&#REF!&2,dd,DD!Q1,FALSE)","v":{"$error":"#REF!"}},{"$f":"VLOOKUP(#REF!&#REF!&2,dd,DD!R1,FALSE)","v":{"$error":"#REF!"}},{"$f":"VLOOKUP(#REF!&#REF!&2,dd,DD!S1,FALSE)","v":{"$error":"#REF!"}},{"$f":"VLOOKUP(#REF!&#REF!&2,dd,DD!T1,FALSE)","v":{"$error":"#REF!"}}]
[null,"Standard",{"$f":"VLOOKUP(#REF!&#REF!&3,dd,DD!L1,FALSE)","v":{"$error":"#REF!"}},{"$f":"VLOOKUP(#REF!&#REF!&3,dd,DD!M1,FALSE)","v":{"$error":"#REF!"}},{"$f":"VLOOKUP(#REF!&#REF!&3,dd,DD!N1,FALSE)","v":{"$error":"#REF!"}},{"$f":"VLOOKUP(#REF!&#REF!&3,dd,DD!O1,FALSE)","v":{"$error":"#REF!"}},{"$f":"VLOOKUP(#REF!&#REF!&3,dd,DD!P1,FALSE)","v":{"$error":"#REF!"}},{"$f":"VLOOKUP(#REF!&#REF!&3,dd,DD!Q1,FALSE)","v":{"$error":"#REF!"}},{"$f":"VLOOKUP(#REF!&#REF!&3,dd,DD!R1,FALSE)","v":{"$error":"#REF!"}},{"$f":"VLOOKUP(#REF!&#REF!&3,dd,DD!S1,FALSE)","v":{"$error":"#REF!"}},{"$f":"VLOOKUP(#REF!&#REF!&3,dd,DD!T1,FALSE)","v":{"$error":"#REF!"}}]
[]
[null,null,"Apr 2015","May 2015","Jun 2015","Jul 2015","Aug 2015","Sep 2015","Oct 2015","Nov 2015","Dec 2015","Jan 2016"]
[1,"Community Care Assessment reasons",{"$f":"IFERROR(VLOOKUP(#REF!&$A10,reason,DD!AB$1,FALSE),\"-\")","v":"-"},{"$f":"IFERROR(VLOOKUP(#REF!&$A10,reason,DD!AC$1,FALSE),\"-\")","v":"-"},{"$f":"IFERROR(VLOOKUP(#REF!&$A10,reason,DD!AD$1,FALSE),\"-\")","v":"-"},{"$f":"IFERROR(VLOOKUP(#REF!&$A10,reason,DD!AE$1,FALSE),\"-\")","v":"-"},{"$f":"IFERROR(VLOOKUP(#REF!&$A10,reason,DD!AF$1,FALSE),\"-\")","v":"-"},{"$f":"IFERROR(VLOOKUP(#REF!&$A10,reason,DD!AG$1,FALSE),\"-\")","v":"-"},{"$f":"IFERROR(VLOOKUP(#REF!&$A10,reason,DD!AH$1,FALSE),\"-\")","v":"-"},{"$f":"IFERROR(VLOOKUP(#REF!&$A10,reason,DD!AI$1,FALSE),\"-\")","v":"-"},{"$f":"IFERROR(VLOOKUP(#REF!&$A10,reason,DD!AJ$1,FALSE),\"-\")","v":"-"},{"$f":"IFERROR(VLOOKUP(#REF!&$A10,reason,DD!AK$1,FALSE),\"-\")","v":"-"}]
[2,"Patients waiting to go home",{"$f":"IFERROR(VLOOKUP(#REF!&$A11,reason,DD!AB$1,FALSE),\"-\")","v":"-"},{"$f":"IFERROR(VLOOKUP(#REF!&$A11,reason,DD!AC$1,FALSE),\"-\")","v":"-"},{"$f":"IFERROR(VLOOKUP(#REF!&$A11,reason,DD!AD$1,FALSE),\"-\")","v":"-"},{"$f":"IFERROR(VLOOKUP(#REF!&$A11,reason,DD!AE$1,FALSE),\"-\")","v":"-"},{"$f":"IFERROR(VLOOKUP(#REF!&$A11,reason,DD!AF$1,FALSE),\"-\")","v":"-"},{"$f":"IFERROR(VLOOKUP(#REF!&$A11,reason,DD!AG$1,FALSE),\"-\")","v":"-"},{"$f":"IFERROR(VLOOKUP(#REF!&$A11,reason,DD!AH$1,FALSE),\"-\")","v":"-"},{"$f":"IFERROR(VLOOKUP(#REF!&$A11,reason,DD!AI$1,FALSE),\"-\")","v":"-"},{"$f":"IFERROR(VLOOKUP(#REF!&$A11,reason,DD!AJ$1,FALSE),\"-\")","v":"-"},{"$f":"IFERROR(VLOOKUP(#REF!&$A11,reason,DD!AK$1,FALSE),\"-\")","v":"-"}]
[3,"Awaiting funding for a care home placement",{"$f":"IFERROR(VLOOKUP(#REF!&$A12,reason,DD!AB$1,FALSE),\"-\")","v":"-"},{"$f":"IFERROR(VLOOKUP(#REF!&$A12,reason,DD!AC$1,FALSE),\"-\")","v":"-"},{"$f":"IFERROR(VLOOKUP(#REF!&$A12,reason,DD!AD$1,FALSE),\"-\")","v":"-"},{"$f":"IFERROR(VLOOKUP(#REF!&$A12,reason,DD!AE$1,FALSE),\"-\")","v":"-"},{"$f":"IFERROR(VLOOKUP(#REF!&$A12,reason,DD!AF$1,FALSE),\"-\")","v":"-"},{"$f":"IFERROR(VLOOKUP(#REF!&$A12,reason,DD!AG$1,FALSE),\"-\")","v":"-"},{"$f":"IFERROR(VLOOKUP(#REF!&$A12,reason,DD!AH$1,FALSE),\"-\")","v":"-"},{"$f":"IFERROR(VLOOKUP(#REF!&$A12,reason,DD!AI$1,FALSE),\"-\")","v":"-"},{"$f":"IFERROR(VLOOKUP(#REF!&$A12,reason,DD!AJ$1,FALSE),\"-\")","v":"-"},{"$f":"IFERROR(VLOOKUP(#REF!&$A12,reason,DD!AK$1,FALSE),\"-\")","v":"-"}]
[4,"Awaiting place availability in a care home",{"$f":"IFERROR(VLOOKUP(#REF!&$A13,reason,DD!AB$1,FALSE),\"-\")","v":"-"},{"$f":"IFERROR(VLOOKUP(#REF!&$A13,reason,DD!AC$1,FALSE),\"-\")","v":"-"},{"$f":"IFERROR(VLOOKUP(#REF!&$A13,reason,DD!AD$1,FALSE),\"-\")","v":"-"},{"$f":"IFERROR(VLOOKUP(#REF!&$A13,reason,DD!AE$1,FALSE),\"-\")","v":"-"},{"$f":"IFERROR(VLOOKUP(#REF!&$A13,reason,DD!AF$1,FALSE),\"-\")","v":"-"},{"$f":"IFERROR(VLOOKUP(#REF!&$A13,reason,DD!AG$1,FALSE),\"-\")","v":"-"},{"$f":"IFERROR(VLOOKUP(#REF!&$A13,reason,DD!AH$1,FALSE),\"-\")","v":"-"},{"$f":"IFERROR(VLOOKUP(#REF!&$A13,reason,DD!AI$1,FALSE),\"-\")","v":"-"},{"$f":"IFERROR(VLOOKUP(#REF!&$A13,reason,DD!AJ$1,FALSE),\"-\")","v":"-"},{"$f":"IFERROR(VLOOKUP(#REF!&$A13,reason,DD!AK$1,FALSE),\"-\")","v":"-"}]
[5,"Healthcare Arrangements",{"$f":"IFERROR(VLOOKUP(#REF!&$A14,reason,DD!AB$1,FALSE),\"-\")","v":"-"},{"$f":"IFERROR(VLOOKUP(#REF!&$A14,reason,DD!AC$1,FALSE),\"-\")","v":"-"},{"$f":"IFERROR(VLOOKUP(#REF!&$A14,reason,DD!AD$1,FALSE),\"-\")","v":"-"},{"$f":"IFERROR(VLOOKUP(#REF!&$A14,reason,DD!AE$1,FALSE),\"-\")","v":"-"},{"$f":"IFERROR(VLOOKUP(#REF!&$A14,reason,DD!AF$1,FALSE),\"-\")","v":"-"},{"$f":"IFERROR(VLOOKUP(#REF!&$A14,reason,DD!AG$1,FALSE),\"-\")","v":"-"},{"$f":"IFERROR(VLOOKUP(#REF!&$A14,reason,DD!AH$1,FALSE),\"-\")","v":"-"},{"$f":"IFERROR(VLOOKUP(#REF!&$A14,reason,DD!AI$1,FALSE),\"-\")","v":"-"},{"$f":"IFERROR(VLOOKUP(#REF!&$A14,reason,DD!AJ$1,FALSE),\"-\")","v":"-"},{"$f":"IFERROR(VLOOKUP(#REF!&$A14,reason,DD!AK$1,FALSE),\"-\")","v":"-"}]
[6,"Other",{"$f":"IFERROR(VLOOKUP(#REF!&$A15,reason,DD!AB$1,FALSE),\"-\")","v":"-"},{"$f":"IFERROR(VLOOKUP(#REF!&$A15,reason,DD!AC$1,FALSE),\"-\")","v":"-"},{"$f":"IFERROR(VLOOKUP(#REF!&$A15,reason,DD!AD$1,FALSE),\"-\")","v":"-"},{"$f":"IFERROR(VLOOKUP(#REF!&$A15,reason,DD!AE$1,FALSE),\"-\")","v":"-"},{"$f":"IFERROR(VLOOKUP(#REF!&$A15,reason,DD!AF$1,FALSE),\"-\")","v":"-"},{"$f":"IFERROR(VLOOKUP(#REF!&$A15,reason,DD!AG$1,FALSE),\"-\")","v":"-"},{"$f":"IFERROR(VLOOKUP(#REF!&$A15,reason,DD!AH$1,FALSE),\"-\")","v":"-"},{"$f":"IFERROR(VLOOKUP(#REF!&$A15,reason,DD!AI$1,FALSE),\"-\")","v":"-"},{"$f":"IFERROR(VLOOKUP(#REF!&$A15,reason,DD!AJ$1,FALSE),\"-\")","v":"-"},{"$f":"IFERROR(VLOOKUP(#REF!&$A15,reason,DD!AK$1,FALSE),\"-\")","v":"-"}]
{"$rows_left_out":1}
{"sheet":"Combo","index":8,"n_rows":21,"n_cols":15,"rows_kept":21,"cut":false,"hidden":true,"merged":[]}
["18-74",1]
["75+",2]
["All",3]
[]
["All",1]
["Code 9",2]
["Standard",3]
[]
[]
[]
["Partnership","List","ACP1","ACP2","Comm","A&E1","DD OBD1","EM Ad1","Em Ad2","Em OBD1","Em OBD2","Eol OBD","EoL %","Mortality","Readmission"]
["Argyll & Bute",1,null,null,"Not enough data to make an assesment","Not enough data to make an assesment","Not enough data to make an assesment","Not enough data to make an assesment",null,null,null,null,null,"Not enough data to make an assesment"]
["City of Edinburgh",2,null,null,"Not enough data to make an assesment","Not enough data to make an assesment","Not enough data to make an assesment","Not enough data to make an assesment",null,null,null,null,null,"Not enough data to make an assesment"]
["Fife",3,null,null,"Not enough data to make an assesment","Not enough data to make an assesment","Not enough data to make an assesment","Not enough data to make an assesment",null,null,null,null,null,"Not enough data to make an assesment"]
["Glasgow City",4,null,null,"Not enough data to make an assesment","Not enough data to make an assesment","Not enough data to make an assesment","Not enough data to make an assesment",null,null,null,null,null,"Not enough data to make an assesment"]
{"$rows_left_out":7}
{"sheet":"Intro","index":9,"n_rows":17,"n_cols":2,"rows_kept":17,"cut":false,"hidden":false,"merged":[]}
[]
[]
[null,"The Care Experience Improvement Model (CEIM) Process Implementation Dashboard "]
[]
[]
[null,"This is a tool that can be used to support measurment in process reliability when implementing"]
[null,"CEIM into team practice."]
[]
[null,"Instructions:"]
[">","Click on the 'Process Implementation' tab to start"]
[">","On first use, add the commencement date to each table (e.g. 01/01/2022), press 'return' then click back on the cell to highlight. Drag the toggle from the bottom right hand side of the cell down to the last cell in the table."]
[">","Record the date each time the dashboard is updated in the 'Last Updated' cell at the top of the excel workbook."]
[">","Record the results for each of the measures each month in the 'Total No.' column."]
[">","Record any notes you have about things that affect the process reliability in the 'Annotations' column."]
[]
{"$rows_left_out":3}
{"sheet":"Process Implementation","index":10,"n_rows":123,"n_cols":14,"rows_kept":123,"cut":false,"hidden":false,"merged":[]}
[null,"Care Experience Improvement Model (CEIM) ",null,null,null,null,null,"Last upated:"]
[null,"Process implementation measurement dashboard"]
[]
[null,"1. Total care experience CONVERSATIONS per month",null,null,null,"Click Here for Operational Definition - Measure 1"]
[null,"Month","Total no.","Mean (Avg)","Annotations (click for definition)"]
[null,null,null,{"$f":"IF(OR(ISBLANK(C6)), NA(), AVERAGE($C$6:$C$21))","v":{"$error":"#N/A"}},null,null,null,null,null,null,null,null,null," "]
[null,null,null,{"$f":"IF(OR(ISBLANK(C7)), NA(), AVERAGE($C$6:$C$21))","v":{"$error":"#N/A"}}]
[null,null,null,{"$error":"#N/A"}]
[null,null,null,{"$error":"#N/A"}]
[null,null,null,{"$error":"#N/A"}]
[null,null,null,{"$error":"#N/A"}]
[null,null,null,{"$error":"#N/A"}]
[null,null,null,{"$error":"#N/A"}]
[null,null,null,{"$error":"#N/A"}]
[null,null,null,{"$error":"#N/A"}]
{"$rows_left_out":108}